F                                                                        [100%]
================================== FAILURES ===================================
__________ test_project_metadata_advertises_beta_development_status ___________

    def test_project_metadata_advertises_beta_development_status() -> None:
        project = tomllib.loads((ROOT / "pyproject.toml").read_text(encoding="utf-8"))["project"]
        statuses = [item for item in project["classifiers"] if item.startswith("Development Status ::")]
>       assert statuses == ["Development Status :: 4 - Beta"]
E       AssertionError: assert ['Development...:: 3 - Alpha'] == ['Development... :: 4 - Beta']
E
E         At index 0 diff: 'Development Status :: 3 - Alpha' != 'Development Status :: 4 - Beta'
E         Use -v to get more diff

tests\test_v06_release_metadata.py:19: AssertionError
=========================== short test summary info ===========================
FAILED tests/test_v06_release_metadata.py::test_project_metadata_advertises_beta_development_status
1 failed, 12 deselected in 0.33s
